BDBM309527 N-{4-chloro-2-[(2-thienylsulfonyl)amino]phenyl}-1-benzofuran-2-sulfonamide::US9603834, 26
SMILES Clc1ccc(NS(=O)(=O)c2cc3ccccc3o2)c(NS(=O)(=O)c2cccs2)c1
InChI Key InChIKey=UXTNDKGCBJPVAP-UHFFFAOYSA-N
Data  1 IC50
  Tab Delimited (TSV)   2D SDfile   Computed 3D by Vconf -m prep SDfile
Find this compound or compounds like it in BindingDB:
Activity Spreadsheet -- Enzyme Inhibition Constant Data from BindingDB
Found 1 hit for monomerid = 309527
TargetC-C chemokine receptor type 2(Homo sapiens (Human))
Allergan
US Patent
LigandPNGBDBM309527(N-{4-chloro-2-[(2-thienylsulfonyl)amino]phenyl}-1-...)
Affinity DataIC50:  145nM. Assay description: HEK-Gqi5 cells stably expressing CCR2 were cultured in (DMEM high glucose, 10% FBS, 1% PSA, 400 μg/ml geneticin and 50 μg/ml hygromycin. Ap...
Ligand InfoPC cidPC sid
In DepthDetails US Patent